{"text_format":"1","workbook":"xlsx","n_sheets":5,"sheets":["入力フォーム","申込書（金融機関等用）","申込書（勤務先用）","申込書（加入者控）","リスト"],"not_rendered":{"charts":0,"images":0,"macros":1,"external_links":0,"defined_names":3,"comments":1,"pivot_tables":0},"unopened":[],"bounds":{"document_bytes":16777216,"sheet_cells":100000,"rows_first":2000,"rows_last":500,"rows_between":2000,"halvings":0,"cell_chars":16384,"cell_head_chars":4096},"cells_cut":0,"cells_raw":0,"read":"whole","date_system":"1900"}

{"sheet":"入力フォーム","index":0,"n_rows":101,"n_cols":19,"rows_kept":101,"cut":false,"hidden":false,"merged":[[105,0,107,23],[99,8,99,19],[100,8,100,19],[102,0,104,23],[0,0,0,23],[1,0,1,23],[82,0,82,23],[2,0,2,9],[39,0,39,9],[51,0,51,9],[30,3,30,6],[8,3,8,11],[10,3,10,7],[14,3,14,6],[20,3,20,9],[26,4,26,12],[53,15,53,17],[76,0,76,9],[83,0,83,9],[28,4,28,12],[12,3,12,7],[16,3,16,19],[18,3,18,19],[42,4,42,7],[87,4,87,14],[90,4,90,14],[53,3,53,6],[57,3,57,5],[57,7,57,9],[85,3,85,9]]}
["財産形成（年金・住宅）貯蓄申込書"]
["　　　　　　　　○にはチェックを、□内には直接入力又は選択して入力し、内容を確認の上、最下部の印刷ボタンを押下してください。"]
["１～１２　全員入力必須"]
[null,null,1,"財産形成貯蓄の種類"]
[null,null,null,0]
[]
[]
[null,null,2,"取扱金融機関等"]
[]
[null,null,3,"勤務先（給与支給庁（本庁）を選択）"]
[]
[null,null,4,"生年月日"]
[]
[null,null,5,"郵便番号"]
[]
[null,null,6,"住所（漢字）"]
[]
[null,null,7,"住所（ふりがな）"]
[]
[null,null,8,"電話番号"]
[]
[null,null,9,"男女別"]
[null,null,null,0]
[]
[null,null,10,"貯蓄の種類（種別）"]
[null,null,null,"10-1","貯蓄の種類（種別）"]
[]
[null,null,null,"10-2","該当する号数　※年金・住宅のみ"]
[]
[null,null,11,"積立開始日"]
{"$rows_left_out":72}
{"sheet":"申込書（金融機関等用）","index":1,"n_rows":76,"n_cols":53,"rows_kept":76,"cut":false,"hidden":false,"merged":[[61,4,61,19],[52,16,53,21],[75,3,75,15],[9,26,10,27],[9,28,10,29],[53,1,54,6],[55,1,55,4],[56,1,57,4],[56,5,57,18],[55,5,55,18],[52,22,53,27],[52,8,53,15],[66,23,67,23],[66,24,67,24],[66,25,67,25],[66,26,67,26],[66,27,67,27],[66,28,67,28],[66,29,67,29],[60,4,60,19],[48,12,49,14],[47,10,49,11],[32,22,45,22],[32,1,49,1],[62,38,63,40],[74,1,74,29],[63,31,63,35],[64,31,64,35],[65,31,65,35],[66,31,66,35],[58,1,59,4],[62,1,62,4],[63,1,65,4],[66,1,67,4],[68,1,69,4],[70,1,71,4],[72,1,73,4],[64,29,65,29],[64,23,65,23],[64,24,65,24],[64,25,65,25],[64,26,65,26],[64,27,65,27],[64,28,65,28],[65,8,65,22],[63,8,63,22],[64,8,64,22],[69,31,70,35],[32,36,33,36],[47,26,49,30],[40,19,41,20],[42,19,43,20],[44,19,46,20],[32,9,32,20],[34,9,35,15],[34,16,35,16],[34,17,35,19],[34,20,35,20],[36,9,37,15],[36,16,37,16],[36,17,37,19],[34,33,35,35],[34,36,35,37],[47,2,47,9],[48,2,49,9],[48,15,49,15],[47,13,47,14],[48,16,49,16],[6,20,7,21],[15,1,16,4],[19,1,20,4],[17,1,18,8],[19,5,20,10],[40,2,46,2],[44,13,46,14],[44,15,46,16],[32,2,33,8],[34,2,35,8],[40,3,41,10],[42,3,43,10],[44,3,46,10],[42,11,43,12],[42,13,43,14],[42,15,43,16],[44,11,46,12],[40,11,41,12],[40,13,41,14],[40,15,41,16],[33,9,33,20],[6,5,7,19],[11,1,14,4],[19,11,20,11],[19,15,20,15],[9,5,10,21],[11,5,12,21],[19,16,20,19],[13,18,14,18],[13,19,14,19],[13,20,14,20],[13,5,14,11],[13,21,14,21],[13,12,14,12],[13,13,14,13],[13,14,14,14],[13,15,14,15],[13,16,14,16],[13,17,14,17],[73,5,73,7],[71,19,71,21],[73,19,73,21],[71,22,71,29],[73,22,73,29],[73,8,73,18],[72,8,72,29],[71,8,71,18],[71,42,71,45],[72,5,72,7],[71,48,71,50],[48,19,49,19],[48,18,49,18],[48,17,49,17],[48,20,49,20],[56,19,57,34],[55,19,55,34],[58,5,59,34],[54,29,54,34],[71,5,71,7],[62,30,62,35],[62,5,62,22],[65,5,65,7],[63,5,63,7],[64,5,64,7],[66,5,67,7],[68,5,68,7],[69,5,69,7],[70,5,70,7],[70,8,70,29],[68,8,68,29],[69,8,69,29],[66,8,67,22],[62,23,62,29],[58,37,58,54],[44,17,46,18],[15,27,15,34],[42,17,43,18],[9,22,10,25],[11,22,11,25],[12,22,13,25],[14,22,14,25],[15,22,18,25],[19,22,20,25],[34,38,35,42],[15,5,16,21],[17,9,18,21],[40,17,41,18],[12,26,13,48],[11,26,11,48],[9,46,10,48],[32,37,33,39],[36,20,37,20],[36,46,37,47],[38,17,39,20],[32,40,33,40],[34,28,35,32],[42,45,42,46],[43,45,43,46],[1,18,1,22],[2,18,2,22],[3,18,3,22],[1,24,2,30],[3,24,3,30],[31,8,31,21],[30,8,30,21],[5,21,5,36],[9,38,10,39],[9,40,10,41],[9,42,10,43],[9,44,10,45],[38,9,39,10],[38,12,39,16],[36,2,37,8],[38,2,39,8],[9,30,10,31],[9,32,10,33],[9,34,10,35],[9,36,10,37],[6,1,7,4],[9,1,10,4],[19,12,20,14],[9,49,9,53],[10,49,13,53],[14,26,14,53],[16,26,18,53],[6,47,7,53],[19,26,20,53],[32,41,33,53],[44,28,45,53],[34,43,35,49],[34,50,35,51],[34,52,35,53],[36,28,37,34],[36,35,37,36],[36,37,37,43],[36,44,37,45],[36,48,37,48],[36,49,37,50],[36,51,37,53],[32,23,33,27],[34,23,35,27],[36,23,37,27],[38,23,43,27],[44,23,45,27],[32,28,33,35]]}
["（国家公務員用）"]
[null,null,null,null,null,null,null,null,null,null,null,null,null,null,null,null,null,{"$f":"IF(入力フォーム!$D$5=1,\"☑\",\"□\")","v":"□"},"財  産  形  成",null,null,null,null,null,"貯蓄申込書"]
[null,null,null,null,null,null,null,null,null,null,null,null,null,null,null,null,null,{"$f":"IF(入力フォーム!$D$5=2,\"☑\",\"□\")","v":"□"},"財産形成年金"]
[null,null,null,null,null,null,null,null,null,null,null,null,null,null,null,null,null,{"$f":"IF(入力フォーム!$D$5=3,\"☑\",\"□\")","v":"□"},"財産形成住宅",null,null,null,null,null,"（兼   印   鑑   届）"]
[]
[null,null,null,null,null,null,null,null,null,null,null,null,null,null,null,null,null,null,null,null,null,{"$f":"IF(R3=\"☑\",リスト!F2,IF(R4=\"☑\",リスト!F3,\"\"))","v":""}]
[null,"取扱金融\n機 関 等",null,null,null,{"$f":"入力フォーム!D9","v":0},null,null,null,null,null,null,null,null,null,null,null,null,null,null,"御中",null,null,null,null,null,null,null,null,null,null,null,null,null,null,null,null,null,null,null,null,null,null,null,null,null,null,{"$f":"TODAY()","v":"2025-03-18"}]
[]
[]
[null,"勤  務  先",null,null,null,{"$f":"入力フォーム!D11","v":0},null,null,null,null,null,null,null,null,null,null,null,null,null,null,null,null,"職 員 番 号",null,null,null,null,null,null,null,null,null,null,null,null,null,null,null,null,null,null,null,null,null,null,null,null,null,null,"お届出印"]
[]
[null,"所属部課\n同  番  号",null,null,null,null,null,null,null,null,null,null,null,null,null,null,null,null,null,null,null,null,"ふりがな"]
[null,null,null,null,null,null,null,null,null,null,null,null,null,null,null,null,null,null,null,null,null,null,"氏　    名"]
[]
[null,null,null,null,null,null,null,null,null,null,null,null,null,null,null,null,null,null,null,null,null,null,"ふりがな",null,null,null,{"$f":"入力フォーム!D19","v":0}]
[null,"所  在  地",null,null,null,{"$f":"VLOOKUP(F10,リスト!A2:B79,2,FALSE)","v":{"$error":"#N/A"}},null,null,null,null,null,null,null,null,null,null,null,null,null,null,null,null,"住　    所",null,null,null,"(〒",{"$f":"入力フォーム!D15","v":0},null,null,null,null,null,null,null,")"]
[null,null,null,null,null,null,null,null,null,null,null,null,null,null,null,null,null,null,null,null,null,null,null,null,null,null,{"$f":"入力フォーム!D17","v":0}]
[null,"法人番号\n（年金・住宅貯蓄の場合に記入）",null,null,null,null,null,null,null,{"$f":"IF(OR(R3=\"☑\",R4=\"☑\"),VLOOKUP(F10,リスト!A1:C79,3,FALSE),\"\")","v":""}]
[]
[null,"生年月日",null,null,null,{"$f":"入力フォーム!D13","v":"00:00:00"},null,null,null,null,null,"(満",{"$f":"DATEDIF(F20,TODAY(),\"Y\")","v":125},null,null,"歳)","男女別",null,null,null,"男","女","電 話 番 号",null,null,null,{"$f":"入力フォーム!D21","v":0}]
[null,null,null,null,null,null,null,null,null,null,null,null,null,null,null,null,null,null,null,null,{"$f":"IF(入力フォーム!$D$23=1,\"☑\",\"□\")","v":"□"},{"$f":"IF(入力フォーム!$D$23=2,\"☑\",\"□\")","v":"□"}]
[null,"1. 私は、勤労者財産形成促進法第６条第１項、第２項又は第４項による貯蓄を行いたいので、貴行（社・金庫・組合）所定の財産形成貯蓄、財産形成年金貯蓄又は財産形成住宅貯蓄（以下、財産"]
[null,"形成貯蓄等という。）に関する規定及び約款に従って、下記により財産形成貯蓄等の預入等を印鑑を届出のうえ申し込みます。"]
[null,"　この貯蓄については、所属省庁が私の給与から積立額を天引きし私に代わって預入等を行います。私は、財産形成貯蓄については３年以上、財産形成年金・住宅貯蓄については５年以上積み立"]
[null,"てるとともに財産形成貯蓄については１年間払出しをいたしません。財形年金においては、原則として年金による払出しの場合に限り、また財形住宅においては原則として持家としての住宅の取"]
[null,"得等の場合に限り払出しをします。"]
[null,"　この貯蓄（元加利息を含む。）は私から特に申し出をしない限り、満期日後は引き続き貴店（移管があった場合は、移管後の店舗）において財産形成貯蓄等としてお取り扱いください。更新さ"]
[null,"れた財産形成貯蓄等の満期日後についても同様にお取り扱いください。"]
[null,"　なお、有価証券を購入する場合には、その有価証券はすべて貴行（社・金庫）に寄託するとともに大券保管されることに同意いたします。また、ゆうちょ銀行の一般財産形成貯蓄の場合、積立"]
[null,"期間が終了するまで貯金証書を保管してください。"]
{"$rows_left_out":47}
{"sheet":"申込書（勤務先用）","index":2,"n_rows":76,"n_cols":53,"rows_kept":76,"cut":false,"hidden":false,"merged":[[74,1,74,29],[75,3,75,15],[52,28,53,31],[1,24,3,37],[4,24,5,30],[72,1,73,4],[72,5,72,7],[72,8,72,29],[73,5,73,7],[73,8,73,18],[73,19,73,21],[73,22,73,29],[70,1,71,4],[70,5,70,7],[70,8,70,29],[71,5,71,7],[71,8,71,18],[71,19,71,21],[71,22,71,29],[66,26,67,26],[66,27,67,27],[66,28,67,28],[66,29,67,29],[66,31,66,35],[68,1,69,4],[68,5,68,7],[68,8,68,29],[69,5,69,7],[69,8,69,29],[66,1,67,4],[66,5,67,7],[66,8,67,22],[66,23,67,23],[66,24,67,24],[66,25,67,25],[64,27,65,27],[64,28,65,28],[64,29,65,29],[64,31,64,35],[65,5,65,7],[65,8,65,22],[65,31,65,35],[63,1,65,4],[63,5,63,7],[63,8,63,22],[63,31,63,35],[64,5,64,7],[64,8,64,22],[64,23,65,23],[64,24,65,24],[64,25,65,25],[64,26,65,26],[58,1,59,4],[58,5,59,34],[60,4,60,19],[61,4,61,19],[62,1,62,4],[62,5,62,22],[62,23,62,29],[62,30,62,35],[54,29,54,34],[55,1,55,4],[55,5,55,18],[55,19,55,34],[56,1,57,4],[56,5,57,18],[56,19,57,34],[48,19,49,19],[48,20,49,20],[52,8,53,15],[52,16,53,21],[52,22,53,27],[53,1,54,6],[47,2,47,9],[47,10,49,11],[47,13,47,14],[47,26,49,30],[48,2,49,9],[48,12,49,14],[48,15,49,15],[48,16,49,16],[48,17,49,17],[48,18,49,18],[42,45,42,46],[43,45,43,46],[44,3,46,10],[44,11,46,12],[44,13,46,14],[44,15,46,16],[44,17,46,18],[44,19,46,20],[44,23,45,27],[44,28,45,53],[38,23,43,27],[40,17,41,18],[40,19,41,20],[42,3,43,10],[42,11,43,12],[42,13,43,14],[42,15,43,16],[42,17,43,18],[42,19,43,20],[38,2,39,8],[38,9,39,10],[38,12,39,16],[38,17,39,20],[40,2,46,2],[40,3,41,10],[40,11,41,12],[40,13,41,14],[40,15,41,16],[36,37,37,43],[36,44,37,45],[36,46,37,47],[36,48,37,48],[36,49,37,50],[34,20,35,20],[36,51,37,53],[34,50,35,51],[34,52,35,53],[36,2,37,8],[36,9,37,15],[36,16,37,16],[36,17,37,19],[36,20,37,20],[36,23,37,27],[36,28,37,34],[36,35,37,36],[34,23,35,27],[34,28,35,32],[34,33,35,35],[34,36,35,37],[34,38,35,42],[34,43,35,49],[13,16,14,16],[19,22,20,25],[19,26,20,53],[32,1,49,1],[32,2,33,8],[32,9,32,20],[32,22,45,22],[32,23,33,27],[32,28,33,35],[19,1,20,4],[19,5,20,10],[19,11,20,11],[19,12,20,14],[19,15,20,15],[19,16,20,19],[32,36,33,36],[32,37,33,39],[32,40,33,40],[32,41,33,53],[33,9,33,20],[34,2,35,8],[34,9,35,15],[34,16,35,16],[34,17,35,19],[9,5,10,21],[9,22,10,25],[9,26,10,27],[9,28,10,29],[9,30,10,31],[14,26,14,53],[15,1,16,4],[15,5,16,21],[15,22,18,25],[15,27,15,34],[16,26,18,53],[17,1,18,8],[17,9,18,21],[13,17,14,17],[13,18,14,18],[13,19,14,19],[13,20,14,20],[13,21,14,21],[14,22,14,25],[13,5,14,11],[13,12,14,12],[13,13,14,13],[13,14,14,14],[13,15,14,15],[6,1,7,4],[6,20,7,21],[6,47,7,53],[1,18,1,22],[2,18,2,22],[3,18,3,22],[6,5,7,19],[9,44,10,45],[9,46,10,48],[9,49,9,53],[10,49,13,53],[11,1,14,4],[11,5,12,21],[11,22,11,25],[11,26,11,48],[12,22,13,25],[12,26,13,48],[9,32,10,33],[9,34,10,35],[9,36,10,37],[9,38,10,39],[9,40,10,41],[9,42,10,43],[9,1,10,4]]}
["（国家公務員用）"]
[null,null,null,null,null,null,null,null,null,null,null,null,null,null,null,null,null,{"$f":"'申込書（金融機関等用）'!R2","v":"□"},"財  産  形  成",null,null,null,null,null,"貯蓄天引積立依頼書"]
[null,null,null,null,null,null,null,null,null,null,null,null,null,null,null,null,null,{"$f":"'申込書（金融機関等用）'!R3","v":"□"},"財産形成年金"]
[null,null,null,null,null,null,null,null,null,null,null,null,null,null,null,null,null,{"$f":"'申込書（金融機関等用）'!R4","v":"□"},"財産形成住宅"]
[null,null,null,null,null,null,null,null,null,null,null,null,null,null,null,null,null,null,null,null,null,null,null,null,"所 属 省 庁 御 中"]
[]
[null,"取扱金融\n機 関 等",null,null,null,{"$f":"'申込書（金融機関等用）'!F7","v":0},null,null,null,null,null,null,null,null,null,null,null,null,null,null,"御中",null,null,null,null,null,null,null,null,null,null,null,null,null,null,null,null,null,null,null,null,null,null,null,null,null,null,{"$f":"IF('申込書（金融機関等用）'!AV7:BB8=\"\",\"\",'申込書（金融機関等用）'!AV7:BB8)","v":"2025-03-18"}]
[]
[]
[null,"勤  務  先",null,null,null,{"$f":"'申込書（金融機関等用）'!F10","v":0},null,null,null,null,null,null,null,null,null,null,null,null,null,null,null,null,"職 員 番 号",null,null,null,{"$f":"IF('申込書（金融機関等用）'!AA10:AB11=\"\",\"\",'申込書（金融機関等用）'!AA10:AB11)","v":""},null,{"$f":"IF('申込書（金融機関等用）'!AC10:AD11=\"\",\"\",'申込書（金融機関等用）'!AC10:AD11)","v":""},null,{"$f":"IF('申込書（金融機関等用）'!AE10:AF11=\"\",\"\",'申込書（金融機関等用）'!AE10:AF11)","v":""},null,{"$f":"IF('申込書（金融機関等用）'!AG10:AH11=\"\",\"\",'申込書（金融機関等用）'!AG10:AH11)","v":""},null,{"$f":"IF('申込書（金融機関等用）'!AI10:AJ11=\"\",\"\",'申込書（金融機関等用）'!AI10:AJ11)","v":""},null,{"$f":"IF('申込書（金融機関等用）'!AK10:AL11=\"\",\"\",'申込書（金融機関等用）'!AK10:AL11)","v":""},null,{"$f":"IF('申込書（金融機関等用）'!AM10:AN11=\"\",\"\",'申込書（金融機関等用）'!AM10:AN11)","v":""},null,{"$f":"IF('申込書（金融機関等用）'!AO10:AP11=\"\",\"\",'申込書（金融機関等用）'!AO10:AP11)","v":""},null,{"$f":"IF('申込書（金融機関等用）'!AQ10:AR11=\"\",\"\",'申込書（金融機関等用）'!AQ10:AR11)","v":""},null,{"$f":"IF('申込書（金融機関等用）'!AS10:AT11=\"\",\"\",'申込書（金融機関等用）'!AS10:AT11)","v":""},null,null,null,null,"お届出印"]
[]
[null,"所属部課\n同  番  号",null,null,null,null,null,null,null,null,null,null,null,null,null,null,null,null,null,null,null,null,"ふりがな"]
[null,null,null,null,null,null,null,null,null,null,null,null,null,null,null,null,null,null,null,null,null,null,"氏　    名"]
[]
[null,null,null,null,null,null,null,null,null,null,null,null,null,null,null,null,null,null,null,null,null,null,"ふりがな",null,null,null,{"$f":"'申込書（金融機関等用）'!AA15","v":0}]
[null,"所  在  地",null,null,null,{"$f":"'申込書（金融機関等用）'!F16","v":{"$error":"#N/A"}},null,null,null,null,null,null,null,null,null,null,null,null,null,null,null,null,"住　    所",null,null,null,"(〒",{"$f":"'申込書（金融機関等用）'!AB16","v":0},null,null,null,null,null,null,null,")"]
[null,null,null,null,null,null,null,null,null,null,null,null,null,null,null,null,null,null,null,null,null,null,null,null,null,null,{"$f":"'申込書（金融機関等用）'!AA17","v":0}]
[null,"法人番号\n（年金・住宅貯蓄の場合に記入）",null,null,null,null,null,null,null,{"$f":"'申込書（金融機関等用）'!J18","v":""}]
[]
[null,"生年月日",null,null,null,{"$f":"'申込書（金融機関等用）'!F20","v":"00:00:00"},null,null,null,null,null,"(満",{"$f":"'申込書（金融機関等用）'!M20","v":125},null,null,"歳)","男女別",null,null,null,"男","女","電 話 番 号",null,null,null,{"$f":"'申込書（金融機関等用）'!AA20","v":0}]
[null,null,null,null,null,null,null,null,null,null,null,null,null,null,null,null,null,null,null,null,{"$f":"'申込書（金融機関等用）'!U21","v":"□"},{"$f":"'申込書（金融機関等用）'!V21","v":"□"}]
[]
[]
[]
[]
[null,null,"私は、勤労者財産形成促進法第６条第１項、第２項又は第４項による貯蓄を行いたいので、下記により積立額を給与から天引きしたうえ、取扱金融機関等へ預入等していただきますよう依頼します。"]
[null,null,"なお、預入金額等を変更するときは、あらかじめ文書をもってお届けします。"]
[]
[]
[]
{"$rows_left_out":47}
{"sheet":"申込書（加入者控）","index":3,"n_rows":76,"n_cols":53,"rows_kept":76,"cut":false,"hidden":false,"merged":[[74,1,74,29],[75,3,75,15],[52,28,53,31],[72,1,73,4],[72,5,72,7],[72,8,72,29],[73,5,73,7],[73,8,73,18],[73,19,73,21],[73,22,73,29],[70,1,71,4],[70,5,70,7],[70,8,70,29],[71,5,71,7],[71,8,71,18],[71,19,71,21],[71,22,71,29],[66,26,67,26],[66,27,67,27],[66,28,67,28],[66,29,67,29],[66,31,66,35],[68,1,69,4],[68,5,68,7],[68,8,68,29],[69,5,69,7],[69,8,69,29],[66,1,67,4],[66,5,67,7],[66,8,67,22],[66,23,67,23],[66,24,67,24],[66,25,67,25],[64,27,65,27],[64,28,65,28],[64,29,65,29],[64,31,64,35],[65,5,65,7],[65,8,65,22],[65,31,65,35],[63,1,65,4],[63,5,63,7],[63,8,63,22],[63,31,63,35],[64,5,64,7],[64,8,64,22],[64,23,65,23],[64,24,65,24],[64,25,65,25],[64,26,65,26],[58,1,59,4],[58,5,59,34],[60,4,60,19],[61,4,61,19],[62,1,62,4],[62,5,62,22],[62,23,62,29],[62,30,62,35],[54,29,54,34],[55,1,55,4],[55,5,55,18],[55,19,55,34],[56,1,57,4],[56,5,57,18],[56,19,57,34],[48,19,49,19],[48,20,49,20],[52,8,53,15],[52,16,53,21],[52,22,53,27],[53,1,54,6],[47,2,47,9],[47,10,49,11],[47,13,47,14],[47,26,49,30],[48,2,49,9],[48,12,49,14],[48,15,49,15],[48,16,49,16],[48,17,49,17],[48,18,49,18],[42,45,42,46],[43,45,43,46],[44,3,46,10],[44,11,46,12],[44,13,46,14],[44,15,46,16],[44,17,46,18],[44,19,46,20],[44,23,45,27],[44,28,45,53],[38,23,43,27],[40,17,41,18],[40,19,41,20],[42,3,43,10],[42,11,43,12],[42,13,43,14],[42,15,43,16],[42,17,43,18],[42,19,43,20],[38,2,39,8],[38,9,39,10],[38,12,39,16],[38,17,39,20],[40,2,46,2],[40,3,41,10],[40,11,41,12],[40,13,41,14],[40,15,41,16],[36,2,37,8],[36,9,37,15],[36,16,37,16],[36,17,37,19],[36,20,37,20],[36,23,37,27],[36,28,37,34],[36,35,37,36],[34,23,35,27],[34,28,35,32],[34,33,35,35],[34,36,35,37],[34,17,35,19],[34,20,35,20],[36,37,37,43],[36,44,37,45],[36,46,37,47],[36,48,37,48],[36,49,37,50],[36,51,37,53],[34,50,35,51],[34,52,35,53],[34,38,35,42],[34,43,35,49],[19,22,20,25],[19,26,20,53],[30,8,30,21],[31,8,31,21],[32,1,49,1],[32,2,33,8],[32,9,32,20],[32,22,45,22],[32,23,33,27],[32,28,33,35],[19,1,20,4],[19,5,20,10],[19,11,20,11],[19,12,20,14],[19,15,20,15],[19,16,20,19],[32,36,33,36],[32,37,33,39],[32,40,33,40],[32,41,33,53],[33,9,33,20],[34,2,35,8],[34,9,35,15],[34,16,35,16],[15,1,16,4],[15,5,16,21],[15,22,18,25],[15,27,15,34],[16,26,18,53],[17,1,18,8],[17,9,18,21],[13,17,14,17],[13,18,14,18],[13,19,14,19],[13,20,14,20],[13,21,14,21],[14,22,14,25],[13,5,14,11],[13,12,14,12],[13,13,14,13],[13,14,14,14],[13,15,14,15],[13,16,14,16],[9,44,10,45],[9,46,10,48],[9,49,9,53],[10,49,13,53],[11,1,14,4],[11,5,12,21],[11,22,11,25],[11,26,11,48],[12,22,13,25],[12,26,13,48],[9,32,10,33],[9,34,10,35],[9,36,10,37],[9,38,10,39],[9,40,10,41],[9,42,10,43],[9,1,10,4],[9,5,10,21],[9,22,10,25],[9,26,10,27],[9,28,10,29],[9,30,10,31],[14,26,14,53],[6,1,7,4],[6,20,7,21],[6,47,7,53],[1,18,1,22],[1,24,2,30],[2,18,2,22],[3,18,3,22],[3,24,3,30],[5,21,5,36],[6,5,7,19]]}
["（国家公務員用）"]
[null,null,null,null,null,null,null,null,null,null,null,null,null,null,null,null,null,{"$f":"'申込書（勤務先用）'!R2","v":"□"},"財  産  形  成",null,null,null,null,null,"貯蓄申込書"]
[null,null,null,null,null,null,null,null,null,null,null,null,null,null,null,null,null,{"$f":"'申込書（勤務先用）'!R3","v":"□"},"財産形成年金"]
[null,null,null,null,null,null,null,null,null,null,null,null,null,null,null,null,null,{"$f":"'申込書（勤務先用）'!R4","v":"□"},"財産形成住宅",null,null,null,null,null,"（兼   印   鑑   届）"]
[]
[null,null,null,null,null,null,null,null,null,null,null,null,null,null,null,null,null,null,null,null,null,{"$f":"'申込書（金融機関等用）'!V6","v":""}]
[null,"取扱金融\n機 関 等",null,null,null,{"$f":"'申込書（勤務先用）'!F7","v":0},null,null,null,null,null,null,null,null,null,null,null,null,null,null,"御中",null,null,null,null,null,null,null,null,null,null,null,null,null,null,null,null,null,null,null,null,null,null,null,null,null,null,{"$f":"'申込書（勤務先用）'!AV7:BB8","v":"2025-03-18"}]
[]
[]
[null,"勤  務  先",null,null,null,{"$f":"'申込書（勤務先用）'!F10","v":0},null,null,null,null,null,null,null,null,null,null,null,null,null,null,null,null,"職 員 番 号",null,null,null,{"$f":"'申込書（勤務先用）'!AA10:AB11","v":""},null,{"$f":"'申込書（勤務先用）'!AC10:AD11","v":""},null,{"$f":"'申込書（勤務先用）'!AE10:AF11","v":""},null,{"$f":"'申込書（勤務先用）'!AG10:AH11","v":""},null,{"$f":"'申込書（勤務先用）'!AI10:AJ11","v":""},null,{"$f":"'申込書（勤務先用）'!AK10:AL11","v":""},null,{"$f":"'申込書（勤務先用）'!AM10:AN11","v":""},null,{"$f":"'申込書（勤務先用）'!AO10:AP11","v":""},null,{"$f":"'申込書（勤務先用）'!AQ10:AR11","v":""},null,{"$f":"'申込書（勤務先用）'!AS10:AT11","v":""},null,null,null,null,"お届出印"]
[]
[null,"所属部課\n同  番  号",null,null,null,null,null,null,null,null,null,null,null,null,null,null,null,null,null,null,null,null,"ふりがな"]
[null,null,null,null,null,null,null,null,null,null,null,null,null,null,null,null,null,null,null,null,null,null,"氏　    名"]
[]
[null,null,null,null,null,null,null,null,null,null,null,null,null,null,null,null,null,null,null,null,null,null,"ふりがな",null,null,null,{"$f":"'申込書（勤務先用）'!AA15:BB15","v":0}]
[null,"所  在  地",null,null,null,{"$f":"'申込書（勤務先用）'!F16:V17","v":{"$error":"#N/A"}},null,null,null,null,null,null,null,null,null,null,null,null,null,null,null,null,"住　    所",null,null,null,"(〒",{"$f":"'申込書（勤務先用）'!AB16:AI16","v":0},null,null,null,null,null,null,null,")"]
[null,null,null,null,null,null,null,null,null,null,null,null,null,null,null,null,null,null,null,null,null,null,null,null,null,null,{"$f":"'申込書（勤務先用）'!AA17:BB19","v":0}]
[null,"法人番号\n（年金・住宅貯蓄の場合に記入）",null,null,null,null,null,null,null,{"$f":"'申込書（勤務先用）'!J18:V19","v":""}]
[]
[null,"生年月日",null,null,null,{"$f":"'申込書（勤務先用）'!F20:K21","v":"00:00:00"},null,null,null,null,null,"(満",{"$f":"'申込書（勤務先用）'!M20:O21","v":125},null,null,"歳)","男女別",null,null,null,"男","女","電 話 番 号",null,null,null,{"$f":"'申込書（勤務先用）'!AA20:BB21","v":0}]
[null,null,null,null,null,null,null,null,null,null,null,null,null,null,null,null,null,null,null,null,{"$f":"'申込書（勤務先用）'!U21","v":"□"},{"$f":"'申込書（勤務先用）'!V21","v":"□"}]
[null,"1. 私は、勤労者財産形成促進法第６条第１項、第２項又は第４項による貯蓄を行いたいので、貴行（社・金庫・組合）所定の財産形成貯蓄、財産形成年金貯蓄又は財産形成住宅貯蓄（以下、財産"]
[null,"形成貯蓄等という。）に関する規定及び約款に従って、下記により財産形成貯蓄等の預入等を印鑑を届出のうえ申し込みます。"]
[null,"　この貯蓄については、所属省庁が私の給与から積立額を天引きし私に代わって預入等を行います。私は、財産形成貯蓄については３年以上、財産形成年金・住宅貯蓄については５年以上積み立"]
[null,"てるとともに財産形成貯蓄については１年間払出しをいたしません。財形年金においては、原則として年金による払出しの場合に限り、また財形住宅においては原則として持家としての住宅の取"]
[null,"得等の場合に限り払出しをします。"]
[null,"　この貯蓄（元加利息を含む。）は私から特に申し出をしない限り、満期日後は引き続き貴店（移管があった場合は、移管後の店舗）において財産形成貯蓄等としてお取り扱いください。更新さ"]
[null,"れた財産形成貯蓄等の満期日後についても同様にお取り扱いください。"]
[null,"　なお、有価証券を購入する場合には、その有価証券はすべて貴行（社・金庫）に寄託するとともに大券保管されることに同意いたします。また、ゆうちょ銀行の一般財産形成貯蓄の場合、積立"]
[null,"期間が終了するまで貯金証書を保管してください。"]
{"$rows_left_out":47}
{"sheet":"リスト","index":4,"n_rows":79,"n_cols":9,"rows_kept":79,"cut":false,"hidden":true,"merged":[]}
["勤務先","所在地","法人番号","貯蓄の種類",null,null,null,null,"取扱金融機関等"]
["最高裁判所","東京都千代田区隼町４－２",3000013000001,"期日指定定期預金（反復預入）","（租規第３条の11第１項第１号）","（兼 財産形成非課税年金 貯蓄申込書）","財産形成年金貯蓄につき租特法第４条の３第１項","財産形成年金貯蓄につき租税特別措置法第４条の３第１項","りそな銀行（旧あさひ）"]
["東京高等裁判所","東京都千代田区霞が関１－１－４",2000013010001,"定額貯金","（租規第３条の11第１項第２号）","（兼 財産形成非課税住宅 貯蓄申込書）","財産形成住宅貯蓄につき租特法第４条の２第１項","財産形成住宅貯蓄につき租税特別措置法第４条の２第１項","みずほ銀行（旧第一勧業）"]
["東京地方裁判所","東京都千代田区霞が関１－１－４",9000013030001,"自動継続定期預金","（租規第３条の11第１項第４号）",null,null,null,"みずほ銀行（旧富士）"]
["東京家庭裁判所","東京都千代田区霞が関１－１－２",8000013040001,"積立定期預金","（租規第３条の11第１項第５号）",null,null,null,"三菱ＵＦＪ銀行"]
["横浜地方裁判所","神奈川県横浜市中区日本大通９",8000013030002,"金銭信託","（租規第３条の11第１項第６号）",null,null,null,"三井住友銀行"]
["横浜家庭裁判所","神奈川県横浜市中区寿町１－２",7000013040002,"金銭信託プラス貸付信託","（租規第３条の11第１項第８号）",null,null,null,"みずほ信託銀行"]
["さいたま地方裁判所","埼玉県さいたま市浦和区高砂３－１６－４５",7000013030003,"利付金融債","（租規第３条の11第１項第９号）",null,null,null,"三菱ＵＦＪ信託銀行"]
["さいたま家庭裁判所","埼玉県さいたま市浦和区高砂３－１６－４５",6000013040003,"利付金融債（利子一括払）","（租規第３条の２第２号）",null,null,null,"三井住友信託銀行（旧住友）"]
["千葉地方裁判所","千葉県千葉市中央区中央４－１１－２７",6000013030004,"公社債投資信託","（租規第３条の２第４号）",null,null,null,"三井住友信託銀行（旧中央三井）"]
["千葉家庭裁判所","千葉県千葉市中央区中央４－１１－２７",5000013040004,"株式投資信託（50）","（租規第３条の２第５号）",null,null,null,"りそな銀行（旧大和）"]
["水戸地方裁判所","茨城県水戸市大町１－１－３８",5000013030005,"株式投資信託（30）","（租規第３条の２第６号）",null,null,null,"みずほ銀行（旧日本勧業）"]
["宇都宮地方裁判所","栃木県宇都宮市小幡１－１－３８",4000013030006,"国債プラス社債","（租規第３条の２第７号）",null,null,null,"新生銀行"]
["宇都宮家庭裁判所","栃木県宇都宮市小幡１－１－３８",3000013040006,"国債","（租規第３条の２第８号）",null,null,null,"野村證券株式会社"]
["前橋地方裁判所","群馬県前橋市大手町３－１－３４",3000013030007,"生命保険","（租規第３条の２第９号）",null,null,null,"大和証券株式会社"]
["静岡地方裁判所","静岡県静岡市葵区追手町１０－８０",2000013030008,"損害保険",null,null,null,null,"ＳＭＢＣ日興証券株式会社"]
["静岡家庭裁判所","静岡県静岡市葵区城内町１－２０",1000013040008,null,null,null,null,null,"みずほ証券株式会社"]
["甲府地方裁判所","山梨県甲府市中央１－１０－７",1000013030009,null,null,null,null,null,"第一生命保険株式会社"]
["長野地方裁判所","長野県長野市旭町１１０８",8000013030010,null,null,null,null,null,"岩井コスモ証券株式会社"]
["新潟地方裁判所","新潟県新潟市中央区学校町通１－１",7000013030011,null,null,null,null,null,"朝日生命保険相互会社"]
["新潟家庭裁判所","新潟県新潟市中央区川岸町１－５４－１",6000013040011,null,null,null,null,null,"富国生命保険相互会社"]
["大阪高等裁判所","大阪府大阪市北区西天満２－１－１０",1000013010002,null,null,null,null,null,"北海道労働金庫"]
["大阪地方裁判所","大阪府大阪市北区西天満２－１－１０",6000013030012,null,null,null,null,null,"東北労働金庫"]
["大阪家庭裁判所","大阪府大阪市中央区大手前４－１－１３",5000013040012,null,null,null,null,null,"中央労働金庫"]
["京都地方裁判所","京都府京都市中京区菊屋町",5000013030013,null,null,null,null,null,"新潟県労働金庫"]
["京都家庭裁判所","京都府京都市左京区下鴨宮河町１",4000013040013,null,null,null,null,null,"長野県労働金庫"]
["神戸地方裁判所","兵庫県神戸市中央区橘通２－２－１",4000013030014,null,null,null,null,null,"静岡県労働金庫"]
["神戸家庭裁判所","兵庫県神戸市兵庫区荒田町３－４６－１",3000013040014,null,null,null,null,null,"北陸労働金庫"]
["奈良地方裁判所","奈良県奈良市登大路町３５",3000013030015,null,null,null,null,null,"東海労働金庫"]
["大津地方裁判所","滋賀県大津市京町３－１－２",2000013030016,null,null,null,null,null,"近畿労働金庫"]
{"$rows_left_out":49}